Target
Replicase polyprotein 1ab
Ligand
BDBM448364
Substrate
Meas. Tech.
Inhibition of proteolytic activity
IC50
110±35 nM
Citation
 Zhang, CHStone, EADeshmukh, MIppolito, JAGhahremanpour, MMTirado-Rives, JSpasov, KAZhang, STakeo, YKudalkar, SNLiang, ZIsaacs, FLindenbach, BMiller, SJAnderson, KSJorgensen, WL Potent Noncovalent Inhibitors of the Main Protease of SARS-CoV-2 from Molecular Sculpting of the Drug Perampanel Guided by Free Energy Perturbation Calculations ACS Cent Sci 0:0 (2021)    Article 
Target
Name:
Replicase polyprotein 1ab
Synonyms:
ORF1ab polyprotein pp1ab | rep
Type:
Protein
Mol. Mass.:
794070.71
Organism:
2019-nCoV
Description:
P0DTD1
Residue:
7096
  
Inhibitor
Name:
BDBM448364
Synonyms:
Perampanel, 17
Type:
Small organic molecule
Emp. Form.:
C28H21ClN4O5
Mol. Mass.:
528.943
SMILES:
Cc1cccc(COc2cc(Cl)cc(c2)C2C=C(C(=O)N(C2=O)c2cccnc2)c2c[nH]c(=O)[nH]c2=O)c1
: