Target
Protein S100-A9
Ligand
BDBM299079
Substrate
Meas. Tech.
S100A9-RAGE inhibition assay
IC50
100.0±n/a nM
Citation
 Fritzson, ILiberg, DEast, SMackinnon, CPrevost, N N-(heteroaryl)-sulfonamide derivatives useful as S100-inhibitors US Patent  US10125125 Publication Date 11/13/2018 
Target
Name:
Protein S100-A9
Synonyms:
CAGB Calgranulin-B Leukocyte L1 complex heavy chain MRP14 S100 calcium-binding protein A9 S10A9_HUMAN | p14
Type:
Enzyme Catalytic Domain
Mol. Mass.:
13239.84
Organism:
Homo sapiens (Human)
Description:
Residue:
114
  
Inhibitor
Name:
BDBM299079
Synonyms:
1-(3,5-dichlorophenyl)-N-[6-(ethanesulfonyl)-4-hydroxypyridazin-3-yl]methanesulfonamide | US10125125, Example 111
Type:
Small organic molecule
Emp. Form.:
C13H13Cl2N3O5S2
Mol. Mass.:
426.295
SMILES:
CCS(=O)(=O)c1cc(O)c(NS(=O)(=O)Cc2cc(Cl)cc(Cl)c2)nn1
: