Target
Protein arginine N-methyltransferase 5
Ligand
BDBM451298
Substrate
Meas. Tech.
Biochemical Assay
IC50
1.000±n/a nM
Citation
 Tatlock, JHMcAlpine, IJTran-Dube, MBRui, EYWythes, MJKumpf, RAMcTigue, MAPatman, R Substituted carbonucleoside derivatives useful as anticancer agents US Patent  US10709709 Publication Date 7/14/2020 
Target
Name:
Protein arginine N-methyltransferase 5
Synonyms:
72 kDa ICln-binding protein HRMT1L5 IBP72 Jak-binding protein 1 PRMT5/MEP50 complex Protein arginine methyltransferase 5 (PRMT5) SKB1 homolog Shk1 kinase-binding protein 1 homolog
Type:
Enzyme
Mol. Mass.:
72679.99
Organism:
Homo sapiens (Human)
Description:
O14744
Residue:
637
  
Inhibitor
Name:
BDBM451298
Synonyms:
US10709709, Example 125
Type:
Small organic molecule
Emp. Form.:
C20H20BrF2N5O3
Mol. Mass.:
496.305
SMILES:
Nc1ncnc2n(cc(Br)c12)[C@@H]1C[C@H](Oc2cc(F)c(F)c3CCNCc23)[C@@H](O)[C@H]1O
: