Target
Protein arginine N-methyltransferase 5
Ligand
BDBM452999
Substrate
Meas. Tech.
Biochemical Assay
IC50
1.000±n/a nM
Citation
 Luengo, JLin, HHawkins, MShetty, RPitis, PSaborit Villarroya, G Selective inhibitors of protein arginine methyltransferase 5 (PRMT5) US Patent  US10711007 Publication Date 7/14/2020 
Target
Name:
Protein arginine N-methyltransferase 5
Synonyms:
72 kDa ICln-binding protein HRMT1L5 IBP72 Jak-binding protein 1 PRMT5/MEP50 complex Protein arginine methyltransferase 5 (PRMT5) SKB1 homolog Shk1 kinase-binding protein 1 homolog
Type:
Enzyme
Mol. Mass.:
72679.99
Organism:
Homo sapiens (Human)
Description:
O14744
Residue:
637
  
Inhibitor
Name:
BDBM452999
Synonyms:
(2S,3S,4R,5R)-2-((R)-6- chloro-1,3- dihydroisobenzofuran-1-yl)-5- (4-methyl-7H-pyrrolo[2,3- d]pyrimidin-7- yl)tetrahydrofuran-3,4-diol US11214574, Ex# 15 | US11254683, Example 15
Type:
Small organic molecule
Emp. Form.:
C19H18ClN3O4
Mol. Mass.:
387.817
SMILES:
Cc1ncnc2n(ccc12)[C@@H]1O[C@@H]([C@@H](O)[C@H]1O)[C@@H]1OCc2ccc(Cl)cc12
: