Target
Lysine-specific histone demethylase 1A
Ligand
BDBM456488
Substrate
Meas. Tech.
Inhibitory Activity Assay
IC50
0.250±n/a nM
Citation
 Yamashita, SOgawa, TKomatani, H Biphenyl compound or salt thereof US Patent  US10723742 Publication Date 7/28/2020 
Target
Name:
Lysine-specific histone demethylase 1A
Synonyms:
AOF2 Flavin-containing amine oxidase domain-containing protein 2 KDM1A KIAA0601 Lysine-specific demethylase 1 (LSD1) Lysine-specific histone demethylase 1 (LSD1)
Type:
Enzyme
Mol. Mass.:
92901.01
Organism:
Homo sapiens (Human)
Description:
O60341
Residue:
852
  
Inhibitor
Name:
BDBM456488
Synonyms:
US10723742, Example 215 | US11510915, Example 215
Type:
Small organic molecule
Emp. Form.:
C30H29F3N6O2
Mol. Mass.:
562.5855
SMILES:
CCC(O)(CC)Cn1nnc2cc(c(F)c(F)c12)-c1ccc(cc1-c1ccc(C#N)c(F)c1)C(=O)N1CC[C@H](N)C1
: