Target
Lysine-specific histone demethylase 1A
Ligand
BDBM456531
Substrate
Meas. Tech.
Inhibitory Activity Assay
IC50
0.140±n/a nM
Citation
 Yamashita, SOgawa, TKomatani, H Biphenyl compound or salt thereof US Patent  US10723742 Publication Date 7/28/2020 
Target
Name:
Lysine-specific histone demethylase 1A
Synonyms:
AOF2 Flavin-containing amine oxidase domain-containing protein 2 KDM1A KIAA0601 Lysine-specific demethylase 1 (LSD1) Lysine-specific histone demethylase 1 (LSD1)
Type:
Enzyme
Mol. Mass.:
92901.01
Organism:
Homo sapiens (Human)
Description:
O60341
Residue:
852
  
Inhibitor
Name:
BDBM456531
Synonyms:
US10723742, Example 260 US11510915, Example 263
Type:
Small organic molecule
Emp. Form.:
C32H28F4N6O2
Mol. Mass.:
604.5973
SMILES:
N[C@H]1C[C@H]2CC[C@@H]1N2C(=O)c1ccc(c(c1)-c1ccc(C#N)c(F)c1)-c1cc2nnn(CC3(O)CCC3)c2c(C(F)F)c1F
: