Target
Lysine-specific histone demethylase 1A
Ligand
BDBM456542
Substrate
Meas. Tech.
Inhibitory Activity Assay
IC50
0.230±n/a nM
Citation
 Yamashita, SOgawa, TKomatani, H Biphenyl compound or salt thereof US Patent  US10723742 Publication Date 7/28/2020 
Target
Name:
Lysine-specific histone demethylase 1A
Synonyms:
AOF2 Flavin-containing amine oxidase domain-containing protein 2 KDM1A KIAA0601 Lysine-specific demethylase 1 (LSD1) Lysine-specific histone demethylase 1 (LSD1)
Type:
Enzyme
Mol. Mass.:
92901.01
Organism:
Homo sapiens (Human)
Description:
O60341
Residue:
852
  
Inhibitor
Name:
BDBM456542
Synonyms:
US10723742, Example 271 | US11510915, Example 271
Type:
Small organic molecule
Emp. Form.:
C30H28F2N6O2
Mol. Mass.:
542.5791
SMILES:
Cc1c(F)c(cc2nnn(CC3(O)CCC3)c12)-c1ccc(cc1-c1ccc(C#N)c(F)c1)C(=O)N1CC[C@H](N)C1
: