Target
Ribosomal protein S6 kinase alpha-6
Ligand
BDBM286091
Substrate
Meas. Tech.
Kinase Assay
IC50
0.3±0.0 nM
Citation
 Dunn, SEJayanthan, ANagireddy, JRAnnedi, SVan Drie, JHDaynard, TSHuynh, M Carboxamide derivatives useful as rsk inhibitors US Patent  US10758530 Publication Date 9/1/2020 
Target
Name:
Ribosomal protein S6 kinase alpha-6
Synonyms:
90 kDa ribosomal protein S6 kinase 6 RPS6KA6 RPS6KA6(Kin.Dom.2 - C-terminal) RSK4 Ribosomal S6 kinase 4 Ribosomal protein S6 kinase alpha 6 (RSK4) S6K-alpha 6 p90RSK | pp90RSK4
Type:
Serine/threonine-protein kinase
Mol. Mass.:
83868.06
Organism:
Homo sapiens (Human)
Description:
Residue:
745
  
Inhibitor
Name:
BDBM286091
Synonyms:
(R)¿N-(1-(4-aminobenzyl)-1H-pyrazol-4-yl)-9-methyl-6-oxo-6,7,8,9-tetrahydropyrido[3′,2′:4,5]pyrrolo[1,2-a]pyrazine-2-carboxamide US10081632, Compound 18 | US10758530, Compound 18
Type:
Small organic molecule
Emp. Form.:
C22H21N7O2
Mol. Mass.:
415.4478
SMILES:
C[C@@H]1CNC(=O)c2cc3ccc(nc3n12)C(=O)Nc1cnn(Cc2ccc(N)cc2)c1
: