Target
Nitric oxide synthase, brain
Ligand
BDBM50014710
Substrate
Meas. Tech.
Enzyme Inhibition Assay
Ki
25.0±n/a nM
Citation
 Silverman, RBWang, HQin, YZou, FKang, SSJing, Q Mammalian and bacterial nitric oxide synthase inhibitors US Patent  US10759791 Publication Date 9/1/2020 
Target
Name:
Nitric oxide synthase, brain
Synonyms:
Bnos NC-NOS NOS type I nNOS Neuronal nitric oxide synthase Nitric Oxide Synthase, brain Nitric oxide synthase, brain (nNOS) Nitric-oxide synthase, brain (nNOS) Nos1 | Peptidyl-cysteine S-nitrosylase NOS1
Type:
Enzyme
Mol. Mass.:
160570.98
Organism:
Rattus norvegicus (rat)
Description:
Recombinant nNOS overexpressed in E. coli was used in enzyme assays.
Residue:
1429
  
Inhibitor
Name:
BDBM50014710
Synonyms:
CHEMBL3262019 | US10759791, Compound 4
Type:
Small organic molecule
Emp. Form.:
C22H26N4O
Mol. Mass.:
362.468
SMILES:
Cc1cc(N)nc(CCc2cccc(c2)C(O)Cc2cc(C)cc(N)n2)c1
: