Target
Nitric oxide synthase, brain
Ligand
BDBM190667
Substrate
Meas. Tech.
Enzyme Inhibition Assay
Ki
13.0±n/a nM
Citation
 Silverman, RBWang, HQin, YZou, FKang, SSJing, Q Mammalian and bacterial nitric oxide synthase inhibitors US Patent  US10759791 Publication Date 9/1/2020 
Target
Name:
Nitric oxide synthase, brain
Synonyms:
Constitutive NOS NC-NOS NOS type I nNOS NOS1_HUMAN Neuronal nitric oxide synthase Nitric oxide synthase, neuronal (nNOS) bNOS | nNOS
Type:
Homodimer
Mol. Mass.:
160985.98
Organism:
Homo sapiens (Human)
Description:
P29475
Residue:
1434
  
Inhibitor
Name:
BDBM190667
Synonyms:
US10759791, Compound 14j | nNOS inhibitor, 5
Type:
Small organic molecule
Emp. Form.:
C17H24N4
Mol. Mass.:
284.3993
SMILES:
CNCCCc1cncc(CCc2cc(C)cc(N)n2)c1
: