Target
Acetyl-CoA carboxylase 1
Ligand
BDBM459212
Substrate
Meas. Tech.
Kinase Assay
IC50
1.43±n/a nM
Citation
 Tang, WYang, XGu, ZLi, CZhang, ZWan, ZWang, XZhang, Y Thienopyrimidine derivative and use thereof in medicine US Patent  US10759812 Publication Date 9/1/2020 
Target
Name:
Acetyl-CoA carboxylase 1
Synonyms:
ACAC ACACA_HUMAN ACC1 Acetyl-CoA carboxylase 1 | Acetyl-CoA carboxylase 1 (ACC1)
Type:
Protein
Mol. Mass.:
265543.22
Organism:
Homo sapiens (Human)
Description:
Q13085
Residue:
2346
  
Inhibitor
Name:
BDBM459212
Synonyms:
2-[1-[2-[[(3aR,6aS)-5-cyano-5-hydroxy-2,3,3a,4,6,6a-hexahydro-1H-pentalen-2-yl]oxy]-2-(2-methoxyphenyl)ethyl]-5-methyl-6-oxazol-2-yl-2,4-dioxo-thieno[2,3-d]pyrimid-3-yl]-2-methyl-propanoic acid | US10759812, Example 26
Type:
Small organic molecule
Emp. Form.:
C32H34N4O8S
Mol. Mass.:
634.699
SMILES:
COc1ccccc1C(Cn1c2sc(c(C)c2c(=O)n(c1=O)C(C)(C)C(O)=O)-c1ncco1)O[C@H]1C[C@H]2CC(O)(C[C@H]2C1)C#N
: