Target
Fibroblast growth factor receptor 2 [403-822]
Ligand
BDBM350042
Substrate
IC50
0.800±n/a nM
Citation
 Andrews, SWBlake, JFCook, AGunawardana, IWHunt, KWMetcalf, ATMoreno, DRen, LTang, TP 2-aryl- and 2-heteroaryl-substituted 2-pyridazin-3(2H)-one compounds as inhibitors of FGFR tyrosine kinases US Patent  US10766881 Publication Date 9/8/2020 
Target
Name:
Fibroblast growth factor receptor 2 [403-822]
Synonyms:
BEK FGFR2_HUMAN KGFR | KSAM
Type:
Enzyme Catalytic Domain
Mol. Mass.:
47577.40
Organism:
Homo sapiens (Human)
Description:
aa 403-822
Residue:
420
  
Inhibitor
Name:
BDBM350042
Synonyms:
US10208024, Example 41 | US10766881, Example 41
Type:
Small organic molecule
Emp. Form.:
C24H25FN8O3
Mol. Mass.:
492.5055
SMILES:
COc1cc(OC)c(F)c(c1)-n1nc(ccc1=O)-c1nc(cnc1N)-c1cnn(c1)C1CCNCC1
: