Target
Dual specificity calcium/calmodulin-dependent 3',5'-cyclic nucleotide phosphodiesterase 1A
Ligand
BDBM279100
Substrate
Meas. Tech.
Inhibition Assay
IC50
0.350±n/a nM
Citation
 Juhl, KJessing, MLanggård, MVital, PJKehler, JRasmussen, LKClementson, CMMarigo, M 1H-pyrazolo[4,3-b]pyridines as PDE1 inhibitors US Patent  US10766893 Publication Date 9/8/2020 
Target
Name:
Dual specificity calcium/calmodulin-dependent 3',5'-cyclic nucleotide phosphodiesterase 1A
Synonyms:
61 kDa Cam-PDE Cam-PDE 1A PDE1A_HUMAN | hCam-1
Type:
Protein
Mol. Mass.:
61245.69
Organism:
Homo sapiens (Human)
Description:
P54750
Residue:
535
  
Inhibitor
Name:
BDBM279100
Synonyms:
5-(2-ethoxy-3-pyridyl)-3-methyl-1-[1-methylpropyl]-N-[(5-methyl-1H-pyrazol-3-yl)methyl]pyrazolo[4,3-b]pyridin-7-amine,enantiomer 2 US10512632, Example 131 US10806718, Example 131 | US11634416, Example 131
Type:
Small organic molecule
Emp. Form.:
C23H29N7O
Mol. Mass.:
419.5227
SMILES:
CCOc1ncccc1-c1cc(NCc2cc(C)[nH]n2)c2n(nc(C)c2n1)C(C)CC
: