Target
Dual specificity calcium/calmodulin-dependent 3',5'-cyclic nucleotide phosphodiesterase 1A
Ligand
BDBM279111
Substrate
Meas. Tech.
Inhibition Assay
IC50
0.260±n/a nM
Citation
 Juhl, KJessing, MLanggård, MVital, PJKehler, JRasmussen, LKClementson, CMMarigo, M 1H-pyrazolo[4,3-b]pyridines as PDE1 inhibitors US Patent  US10766893 Publication Date 9/8/2020 
Target
Name:
Dual specificity calcium/calmodulin-dependent 3',5'-cyclic nucleotide phosphodiesterase 1A
Synonyms:
61 kDa Cam-PDE Cam-PDE 1A PDE1A_HUMAN | hCam-1
Type:
Protein
Mol. Mass.:
61245.69
Organism:
Homo sapiens (Human)
Description:
P54750
Residue:
535
  
Inhibitor
Name:
BDBM279111
Synonyms:
1-isopropyl-3-methyl-N-[(1-methylimidazol-4-yl)methyl]-5-(2-propoxy-3-pyridyl)pyrazolo[4,3-b]pyridin-7-amine US10512632, Example 142 US10806718, Example 142 US11634416, Example 142
Type:
Small organic molecule
Emp. Form.:
C23H29N7O
Mol. Mass.:
419.5227
SMILES:
CCCOc1ncccc1-c1cc(NCc2cn(C)cn2)c2n(nc(C)c2n1)C(C)C
: