Target
SUMO-activating enzyme subunit 1
Ligand
BDBM462717
Substrate
Meas. Tech.
Enzyme Assay
IC50
<10±n/a nM
Citation
 Duffey, MOEngland, DFreeze, BSHu, ZLangston, SMcIntyre, CMizutani, HOno, KXu, H Heteroaryl compounds useful as inhibitors of SUMO activating enzyme US Patent  US10780090 Publication Date 9/22/2020 
Target
Name:
SUMO-activating enzyme subunit 1
Synonyms:
AOS1 SAE1_HUMAN SUMO-activating enzyme subunit 1 (SAE1) UBLE1A
Type:
Enzyme Catalytic Domain
Mol. Mass.:
38440.84
Organism:
Homo sapiens (Human)
Description:
gi_17390638
Residue:
346
  
Inhibitor
Name:
BDBM462717
Synonyms:
US10780090, Compound I-53 | [(1R,2S,4R)-4-{[5-({4-[(6-bromopyridin-2-yl)methyl]-2-thienyl}carbonyl)pyrimidin-4- yl]amino}-2-hydroxycyclopentyl]methyl sulfamate
Type:
Small organic molecule
Emp. Form.:
C21H22BrN5O5S2
Mol. Mass.:
568.464
SMILES:
NS(=O)(=O)OC[C@H]1C[C@H](C[C@@H]1O)Nc1ncncc1C(=O)c1cc(Cc2cccc(Br)n2)cs1
: