Target
SUMO-activating enzyme subunit 1
Ligand
BDBM462726
Substrate
Meas. Tech.
Enzyme Assay
IC50
<10±n/a nM
Citation
 Duffey, MOEngland, DFreeze, BSHu, ZLangston, SMcIntyre, CMizutani, HOno, KXu, H Heteroaryl compounds useful as inhibitors of SUMO activating enzyme US Patent  US10780090 Publication Date 9/22/2020 
Target
Name:
SUMO-activating enzyme subunit 1
Synonyms:
AOS1 SAE1_HUMAN SUMO-activating enzyme subunit 1 (SAE1) UBLE1A
Type:
Enzyme Catalytic Domain
Mol. Mass.:
38440.84
Organism:
Homo sapiens (Human)
Description:
gi_17390638
Residue:
346
  
Inhibitor
Name:
BDBM462726
Synonyms:
US10780090, Compound I-60 | {(1R,2S,4R)-2-hydroxy-4-[(5-{[4-(3-methylbenzyl)-2-thienyl]carbonyl}pyrimidin-4- yl)amino]cyclopentyl}methyl sulfamate
Type:
Small organic molecule
Emp. Form.:
C23H26N4O5S2
Mol. Mass.:
502.606
SMILES:
Cc1cccc(Cc2csc(c2)C(=O)c2cncnc2N[C@H]2C[C@H](O)[C@@H](COS(N)(=O)=O)C2)c1
: