Target
SUMO-activating enzyme subunit 1
Ligand
BDBM462985
Substrate
Meas. Tech.
Enzyme Assay
IC50
<10±n/a nM
Citation
 Duffey, MOEngland, DFreeze, BSHu, ZLangston, SMcIntyre, CMizutani, HOno, KXu, H Heteroaryl compounds useful as inhibitors of SUMO activating enzyme US Patent  US10780090 Publication Date 9/22/2020 
Target
Name:
SUMO-activating enzyme subunit 1
Synonyms:
AOS1 SAE1_HUMAN SUMO-activating enzyme subunit 1 (SAE1) UBLE1A
Type:
Enzyme Catalytic Domain
Mol. Mass.:
38440.84
Organism:
Homo sapiens (Human)
Description:
gi_17390638
Residue:
346
  
Inhibitor
Name:
BDBM462985
Synonyms:
US10780090, Compound I-274 US10780090, Compound I-274b | [(1R,2S,4R)-4-{[5-({4-[(1R)-7-chloro-1,2,3,4-tetrahydroisoquinolin-1-yl]-2- thienyl}carbonyl)pyrimidin-4-yl]amino}-2-hydroxycyclopentyl]methyl sulfamate
Type:
Small organic molecule
Emp. Form.:
C24H26ClN5O5S2
Mol. Mass.:
564.077
SMILES:
NS(=O)(=O)OC[C@H]1C[C@H](C[C@@H]1O)Nc1ncncc1C(=O)c1cc(cs1)[C@@H]1NCCc2ccc(Cl)cc12
: