Target
SUMO-activating enzyme subunit 1
Ligand
BDBM463067
Substrate
Meas. Tech.
Enzyme Assay
IC50
<10±n/a nM
Citation
 Duffey, MOEngland, DFreeze, BSHu, ZLangston, SMcIntyre, CMizutani, HOno, KXu, H Heteroaryl compounds useful as inhibitors of SUMO activating enzyme US Patent  US10780090 Publication Date 9/22/2020 
Target
Name:
SUMO-activating enzyme subunit 1
Synonyms:
AOS1 SAE1_HUMAN SUMO-activating enzyme subunit 1 (SAE1) UBLE1A
Type:
Enzyme Catalytic Domain
Mol. Mass.:
38440.84
Organism:
Homo sapiens (Human)
Description:
gi_17390638
Residue:
346
  
Inhibitor
Name:
BDBM463067
Synonyms:
US10780090, Compound I-308 | [(1R,2S,4R)-2-hydroxy-4-{[5-({4-[(1R)-2-methyl-2,3-dihydro-1H-isoindol-1-yl]-2- thienyl}carbonyl)pyrimidin-4-yl]amino}cyclopentyl]methyl sulfamate
Type:
Small organic molecule
Emp. Form.:
C24H27N5O5S2
Mol. Mass.:
529.632
SMILES:
CN1Cc2ccccc2[C@@H]1c1csc(c1)C(=O)c1cncnc1N[C@H]1C[C@H](O)[C@@H](COS(N)(=O)=O)C1
: