Target
Guanylate cyclase soluble subunit alpha-1
Ligand
BDBM463189
Substrate
Meas. Tech.
Binding Assay
Ki
0.457±n/a nM
Citation
 Whitehead, AOrnoski, ORaghavan, SBerger, RGarfunkle, JYang, ZJi, GJiang, FFu, J Fused pyrazine derivatives useful as soluble guanylate cyclase stimulators US Patent  US10780092 Publication Date 9/22/2020 
Target
Name:
Guanylate cyclase soluble subunit alpha-1
Synonyms:
GCS-alpha-1 GCYA1_HUMAN GUCSA3 GUCY1A3 Guanylate cyclase soluble subunit alpha-3 Solube guanylate cyclase alpha-1 (sGCalpha) | soluble guanylate cyclase alpha-1 (sGC)
Type:
Enzyme
Mol. Mass.:
77457.21
Organism:
Homo sapiens (Human)
Description:
Q02108
Residue:
690
  
Inhibitor
Name:
BDBM463189
Synonyms:
4-Amino-2-{8-[(4- fluorophenyl)methyl]imidazo[1,2- a]pyrazin-6-yl}-5-(4- hydroxyphenyl)-5-methyl-5,7- dihydro-6H-pyrrolo[2,3- d]pyrimidin-6-one | US10780092, Example 43-B
Type:
Small organic molecule
Emp. Form.:
C26H20FN7O2
Mol. Mass.:
481.4811
SMILES:
CC1(C(=O)Nc2nc(nc(N)c12)-c1cn2ccnc2c(Cc2ccc(F)cc2)n1)c1ccc(O)cc1
: