Target
Guanylate cyclase soluble subunit alpha-1
Ligand
BDBM463246
Substrate
Meas. Tech.
Binding Assay
Ki
0.544±n/a nM
Citation
 Whitehead, AOrnoski, ORaghavan, SBerger, RGarfunkle, JYang, ZJi, GJiang, FFu, J Fused pyrazine derivatives useful as soluble guanylate cyclase stimulators US Patent  US10780092 Publication Date 9/22/2020 
Target
Name:
Guanylate cyclase soluble subunit alpha-1
Synonyms:
GCS-alpha-1 GCYA1_HUMAN GUCSA3 GUCY1A3 Guanylate cyclase soluble subunit alpha-3 Solube guanylate cyclase alpha-1 (sGCalpha) | soluble guanylate cyclase alpha-1 (sGC)
Type:
Enzyme
Mol. Mass.:
77457.21
Organism:
Homo sapiens (Human)
Description:
Q02108
Residue:
690
  
Inhibitor
Name:
BDBM463246
Synonyms:
4-Amino-5-(4-chloro-3- hydroxyphenyl)-2-{8-[(2- fluorophenyl)methyl]-2- methylimidazo[1,2-a]pyrazin-6- yl}-5-methyl-5,7-dihydro-6H- pyrrolo[2,3-d]pyrimidin-6-one | US10780092, Example 100-A
Type:
Small organic molecule
Emp. Form.:
C27H21ClFN7O2
Mol. Mass.:
529.953
SMILES:
Cc1cn2cc(nc(Cc3ccccc3F)c2n1)-c1nc2NC(=O)C(C)(c2c(N)n1)c1ccc(Cl)c(O)c1
: