Target
Guanylate cyclase soluble subunit alpha-1
Ligand
BDBM463270
Substrate
Meas. Tech.
Binding Assay
Ki
15.6±n/a nM
Citation
 Whitehead, AOrnoski, ORaghavan, SBerger, RGarfunkle, JYang, ZJi, GJiang, FFu, J Fused pyrazine derivatives useful as soluble guanylate cyclase stimulators US Patent  US10780092 Publication Date 9/22/2020 
Target
Name:
Guanylate cyclase soluble subunit alpha-1
Synonyms:
GCS-alpha-1 GCYA1_HUMAN GUCSA3 GUCY1A3 Guanylate cyclase soluble subunit alpha-3 Solube guanylate cyclase alpha-1 (sGCalpha) | soluble guanylate cyclase alpha-1 (sGC)
Type:
Enzyme
Mol. Mass.:
77457.21
Organism:
Homo sapiens (Human)
Description:
Q02108
Residue:
690
  
Inhibitor
Name:
BDBM463270
Synonyms:
4-Amino-5-(3-hydroxy- phenyl)-5-methyl-2-{8- [(3-methylphenyl)methyl]- imidazo[1,2-a]pyrazin-6- yl}-5,7-dihydro-6H-pyrrolo- [2,3-d]pyrimidin-6-one | US10780092, Example 122-B
Type:
Small organic molecule
Emp. Form.:
C27H23N7O2
Mol. Mass.:
477.5172
SMILES:
Cc1cccc(Cc2nc(cn3ccnc23)-c2nc3NC(=O)C(C)(c3c(N)n2)c2cccc(O)c2)c1
: