Target
Guanylate cyclase soluble subunit alpha-1
Ligand
BDBM463299
Substrate
Meas. Tech.
Binding Assay
Ki
0.261±n/a nM
Citation
 Whitehead, AOrnoski, ORaghavan, SBerger, RGarfunkle, JYang, ZJi, GJiang, FFu, J Fused pyrazine derivatives useful as soluble guanylate cyclase stimulators US Patent  US10780092 Publication Date 9/22/2020 
Target
Name:
Guanylate cyclase soluble subunit alpha-1
Synonyms:
GCS-alpha-1 GCYA1_HUMAN GUCSA3 GUCY1A3 Guanylate cyclase soluble subunit alpha-3 Solube guanylate cyclase alpha-1 (sGCalpha) | soluble guanylate cyclase alpha-1 (sGC)
Type:
Enzyme
Mol. Mass.:
77457.21
Organism:
Homo sapiens (Human)
Description:
Q02108
Residue:
690
  
Inhibitor
Name:
BDBM463299
Synonyms:
4-amino-5-(5-chloro- 4-hydroxypyridin-2- yl)-2-{8-(2-fluorobenzyl)- [1,2,4]triazolo[1,5-a]- pyrazin-6-yl}-5-methyl- 5,7-dihydro-6H-pyrrolo- [2,3-c]pyrimidin-6-one | US10780092, Example 148-B
Type:
Small organic molecule
Emp. Form.:
C24H17ClFN9O2
Mol. Mass.:
517.902
SMILES:
CC1(C(=O)Nc2nc(nc(N)c12)-c1cn2ncnc2c(Cc2ccccc2F)n1)c1cc(O)c(Cl)cn1
: