Target
Free fatty acid receptor 2
Ligand
BDBM404137
Substrate
Meas. Tech.
GTPγS Assay
EC50
<200±n/a nM
Citation
 Hoveyda, HRSchils, DZoute, LParcq, J Substituted pyrrolidines as G-protein coupled receptor 43 agonists US Patent  US10781171 Publication Date 9/22/2020 
Target
Name:
Free fatty acid receptor 2
Synonyms:
FFA2 FFAR2_HUMAN GPCR43 | GPR43
Type:
PROTEIN
Mol. Mass.:
37156.44
Organism:
Homo sapiens (Human)
Description:
ChEMBL_1508993
Residue:
330
  
Inhibitor
Name:
BDBM404137
Synonyms:
(2S,5R)-1-(2,2'-dimethoxy-[1,1'-biphenyl]-4-carbonyl)-5-(2-fluorophenyl)pyrrolidine-2-carboxylic acid US10781171, Compound 314 | US11072582, Compound 314
Type:
Small organic molecule
Emp. Form.:
C26H24FNO5
Mol. Mass.:
449.4709
SMILES:
COc1ccccc1-c1ccc(cc1OC)C(=O)N1[C@@H](CC[C@@H]1c1ccccc1F)C(O)=O
: