Target
Free fatty acid receptor 2
Ligand
BDBM404253
Substrate
Meas. Tech.
GTPγS Assay
EC50
<200±n/a nM
Citation
 Hoveyda, HRSchils, DZoute, LParcq, J Substituted pyrrolidines as G-protein coupled receptor 43 agonists US Patent  US10781171 Publication Date 9/22/2020 
Target
Name:
Free fatty acid receptor 2
Synonyms:
FFA2 FFAR2_HUMAN GPCR43 | GPR43
Type:
PROTEIN
Mol. Mass.:
37156.44
Organism:
Homo sapiens (Human)
Description:
ChEMBL_1508993
Residue:
330
  
Inhibitor
Name:
BDBM404253
Synonyms:
(2S,5R)-5-(2,3-difluorophenyl)-1-(4-(2,4-dimethoxypyrimidin-5-yl)benzoyl)pyrrolidine-2-carboxylic acid US10781171, Compound 420 | US11072582, Compound 420
Type:
Small organic molecule
Emp. Form.:
C24H21F2N3O5
Mol. Mass.:
469.4374
SMILES:
COc1ncc(c(OC)n1)-c1ccc(cc1)C(=O)N1[C@@H](CC[C@@H]1c1cccc(F)c1F)C(O)=O
: