Target
Free fatty acid receptor 2
Ligand
BDBM408764
Substrate
Meas. Tech.
Radioligand Binding Assay
Ki
>2000±n/a nM
Citation
 Hoveyda, HRSchils, DZoute, LParcq, J Substituted pyrrolidines as G-protein coupled receptor 43 agonists US Patent  US10781171 Publication Date 9/22/2020 
Target
Name:
Free fatty acid receptor 2
Synonyms:
FFA2 FFAR2_HUMAN GPCR43 | GPR43
Type:
PROTEIN
Mol. Mass.:
37156.44
Organism:
Homo sapiens (Human)
Description:
ChEMBL_1508993
Residue:
330
  
Inhibitor
Name:
BDBM408764
Synonyms:
(2S,5R)-5-(2-chlorophenyl)-1-(1-(2-fluoro-4-nitrophenyl)piperidine-4-carbonyl)pyrrolidine-2-carboxylic acid US10781171, Compound 383
Type:
Small organic molecule
Emp. Form.:
C23H23ClFN3O5
Mol. Mass.:
475.897
SMILES:
OC(=O)[C@@H]1CC[C@@H](N1C(=O)C1CCN(CC1)c1ccc(cc1F)[N+]([O-])=O)c1ccccc1Cl
: