Target
5-hydroxytryptamine receptor 2A
Ligand
BDBM463328
Substrate
Meas. Tech.
[125I]DOI Radioligand Binding Assay
IC50
1.10±n/a nM
Citation
 Teegarden, BXiong, YStrah-Pleynet, SJayakumar, HDosa, PIFeichtinger, KCasper, MLehmann, JJones, RMUnett, DJChoi, JS 3-phenyl-pyrazole derivatives as modulators of the 5-HT2A serotonin receptor useful for the treatment of disorders related thereto US Patent  US10781180 Publication Date 9/22/2020 
Target
Name:
5-hydroxytryptamine receptor 2A
Synonyms:
5-HT-2 5-HT2A 5-hydroxytryptamine receptor 2A (5HT-2A) 5HT2A_HUMAN HTR2A | Serotonin receptor 2A
Type:
undefined
Mol. Mass.:
52607.65
Organism:
Homo sapiens (Human)
Description:
P28223
Residue:
471
  
Inhibitor
Name:
BDBM463328
Synonyms:
[3-(4-Bromo-2-methyl-2H-pyrazol-3-yl)-4-(2-pyrrolidin-1-yl-ethoxy)-phenyl]-carbamic acid isobutyl ester | US10781180, Compound 23
Type:
Small organic molecule
Emp. Form.:
C21H29BrN4O3
Mol. Mass.:
465.384
SMILES:
CCC(C)OC(=O)Nc1ccc(OCCN2CCCC2)c(c1)-c1c(Br)cnn1C
: