Target
Plasma kallikrein
Ligand
BDBM463341
Substrate
Meas. Tech.
Inhibitory Activity Assay
IC50
191±n/a nM
Citation
 Evans, DMDavie, RLEdwards, HJHodgson, ST N-((het) arylmethyl)-heteroaryl-carboxamides compounds as plasma kallikrein inhibitors US Patent  US10781181 Publication Date 9/22/2020 
Target
Name:
Plasma kallikrein
Synonyms:
Fletcher factor KLKB1 Kallikrein Plasma kallikrein heavy chain Plasma prekallikrein
Type:
Protein
Mol. Mass.:
71391.16
Organism:
Homo sapiens (Human)
Description:
P03952
Residue:
638
  
Inhibitor
Name:
BDBM463341
Synonyms:
N-[2-(5-chloro-2-fluorophenoxy)ethyl]-3-(methoxymethyl)-1-({4-[(2-oxopyridin-1- | US10781181, Example 9
Type:
Small organic molecule
Emp. Form.:
C27H26ClFN4O4
Mol. Mass.:
524.971
SMILES:
COCc1nn(Cc2ccc(Cn3ccccc3=O)cc2)cc1C(=O)NCCOc1cc(Cl)ccc1F
: