Target
Plasma kallikrein
Ligand
BDBM463353
Substrate
Meas. Tech.
Inhibitory Activity Assay
IC50
92.8±n/a nM
Citation
 Evans, DMDavie, RLEdwards, HJHodgson, ST N-((het) arylmethyl)-heteroaryl-carboxamides compounds as plasma kallikrein inhibitors US Patent  US10781181 Publication Date 9/22/2020 
Target
Name:
Plasma kallikrein
Synonyms:
Fletcher factor KLKB1 Kallikrein Plasma kallikrein heavy chain Plasma prekallikrein
Type:
Protein
Mol. Mass.:
71391.16
Organism:
Homo sapiens (Human)
Description:
P03952
Residue:
638
  
Inhibitor
Name:
BDBM463353
Synonyms:
3-amino-N-[2-(2,5-dichlorophenoxy)ethyl]-1-({4-[(2-oxopyridin-1- | US10781181, Example 34
Type:
Small organic molecule
Emp. Form.:
C25H23Cl2N5O3
Mol. Mass.:
512.388
SMILES:
Nc1nn(Cc2ccc(Cn3ccccc3=O)cc2)cc1C(=O)NCCOc1cc(Cl)ccc1Cl
: