Target
Plasma kallikrein
Ligand
BDBM463354
Substrate
Meas. Tech.
Inhibitory Activity Assay
IC50
122±n/a nM
Citation
 Evans, DMDavie, RLEdwards, HJHodgson, ST N-((het) arylmethyl)-heteroaryl-carboxamides compounds as plasma kallikrein inhibitors US Patent  US10781181 Publication Date 9/22/2020 
Target
Name:
Plasma kallikrein
Synonyms:
Fletcher factor KLKB1 Kallikrein Plasma kallikrein heavy chain Plasma prekallikrein
Type:
Protein
Mol. Mass.:
71391.16
Organism:
Homo sapiens (Human)
Description:
P03952
Residue:
638
  
Inhibitor
Name:
BDBM463354
Synonyms:
N-[2-(3-chlorophenoxy)ethyl]-3-(dimethylamino)-1-({4-[(2-oxopyridin-1- | US10781181, Example 35
Type:
Small organic molecule
Emp. Form.:
C27H28ClN5O3
Mol. Mass.:
505.996
SMILES:
CN(C)c1nn(Cc2ccc(Cn3ccccc3=O)cc2)cc1C(=O)NCCOc1cccc(Cl)c1
: