Target
Melatonin receptor type 1A
Ligand
BDBM463445
Substrate
Meas. Tech.
Binding Assay
Ki
2.20±n/a nM
Citation
 Ruch Werneck Guimarães, CFelype Zaneti De Azevedo, HMascarello, AWatanabe Da Costa, RFreire Torres Russo, VMannochio De Souza Russo, E Compounds, process for obtaining the compounds, pharmaceutical composition, use of the compounds and method for treating psychiatric disorders and/or sleep disorders US Patent  US10781182 Publication Date 9/22/2020 
Target
Name:
Melatonin receptor type 1A
Synonyms:
MTNR1A MTR1A_HUMAN Mel1a melatonin receptor Melatonin receptor Melatonin receptor type 1 (MT1) | Melatonin receptor type 1A
Type:
Enzyme
Mol. Mass.:
39392.94
Organism:
Homo sapiens (Human)
Description:
P48039
Residue:
350
  
Inhibitor
Name:
BDBM463445
Synonyms:
US10781182, Compound IA2-140 | US11091445, Compound code IA2-140
Type:
Small organic molecule
Emp. Form.:
C14H19N3O3
Mol. Mass.:
277.319
SMILES:
COc1nc2ccc(OC)cc2n1CCCNC(C)=O
: