Target
PAS domain-containing serine/threonine-protein kinase
Ligand
BDBM463442
Substrate
Meas. Tech.
Biochemical Assay
IC50
<1000±n/a nM
Citation
 McCall, JMRomero, DLMcKearn, JClare, M Heterocyclic compounds for the inhibition of PASK US Patent  US10781185 Publication Date 9/22/2020 
Target
Name:
PAS domain-containing serine/threonine-protein kinase
Synonyms:
KIAA0135 PASK PASK_HUMAN | hPASK
Type:
PROTEIN
Mol. Mass.:
142867.26
Organism:
Homo sapiens (Human)
Description:
ChEMBL_944230
Residue:
1323
  
Inhibitor
Name:
BDBM463442
Synonyms:
3-(4-(4-Methoxyphenyl)piperidin-1-yl)-2-phenylquinoxaline-6-carboxylic acid US11459307, Example 11
Type:
Small organic molecule
Emp. Form.:
C27H25N3O3
Mol. Mass.:
439.5057
SMILES:
COc1ccc(cc1)C1CCN(CC1)c1nc2cc(ccc2nc1-c1ccccc1)C(O)=O
: