Target
PAS domain-containing serine/threonine-protein kinase
Ligand
BDBM463454
Substrate
Meas. Tech.
Biochemical Assay
IC50
>1000±n/a nM
Citation
 McCall, JMRomero, DLMcKearn, JClare, M Heterocyclic compounds for the inhibition of PASK US Patent  US10781185 Publication Date 9/22/2020 
Target
Name:
PAS domain-containing serine/threonine-protein kinase
Synonyms:
KIAA0135 PASK PASK_HUMAN | hPASK
Type:
PROTEIN
Mol. Mass.:
142867.26
Organism:
Homo sapiens (Human)
Description:
ChEMBL_944230
Residue:
1323
  
Inhibitor
Name:
BDBM463454
Synonyms:
2-(Azepan-1-yl)-3-phenylquinoxaline-6-carboxylic acid US11459307, Example 22
Type:
Small organic molecule
Emp. Form.:
C21H21N3O2
Mol. Mass.:
347.4103
SMILES:
OC(=O)c1ccc2nc(N3CCCCCC3)c(nc2c1)-c1ccccc1
: