Target
PAS domain-containing serine/threonine-protein kinase
Ligand
BDBM463457
Substrate
Meas. Tech.
Biochemical Assay
IC50
<1000±n/a nM
Citation
 McCall, JMRomero, DLMcKearn, JClare, M Heterocyclic compounds for the inhibition of PASK US Patent  US10781185 Publication Date 9/22/2020 
Target
Name:
PAS domain-containing serine/threonine-protein kinase
Synonyms:
KIAA0135 PASK PASK_HUMAN | hPASK
Type:
PROTEIN
Mol. Mass.:
142867.26
Organism:
Homo sapiens (Human)
Description:
ChEMBL_944230
Residue:
1323
  
Inhibitor
Name:
BDBM463457
Synonyms:
2-(4-(3-Chlorophenyl)piperidin-1-yl)-3-(4-fluorophenyl)quinoxaline-6-carboxylic acid US11459307, Example 25
Type:
Small organic molecule
Emp. Form.:
C26H21ClFN3O2
Mol. Mass.:
461.915
SMILES:
OC(=O)c1ccc2nc(N3CCC(CC3)c3cccc(Cl)c3)c(nc2c1)-c1ccc(F)cc1
: