Target
PAS domain-containing serine/threonine-protein kinase
Ligand
BDBM463450
Substrate
Meas. Tech.
Radiochemical Assay
IC50
<1000±n/a nM
Citation
 McCall, JMRomero, DLMcKearn, JClare, M Heterocyclic compounds for the inhibition of PASK US Patent  US10781185 Publication Date 9/22/2020 
Target
Name:
PAS domain-containing serine/threonine-protein kinase
Synonyms:
KIAA0135 PASK PASK_HUMAN | hPASK
Type:
PROTEIN
Mol. Mass.:
142867.26
Organism:
Homo sapiens (Human)
Description:
ChEMBL_944230
Residue:
1323
  
Inhibitor
Name:
BDBM463450
Synonyms:
3-(Isopropylamino)-2-phenylquinoxaline-6-carboxylic acid US11459307, Example 18
Type:
Small organic molecule
Emp. Form.:
C18H17N3O2
Mol. Mass.:
307.3465
SMILES:
CC(C)Nc1nc2cc(ccc2nc1-c1ccccc1)C(O)=O
: