Target
PAS domain-containing serine/threonine-protein kinase
Ligand
BDBM463550
Substrate
Meas. Tech.
FRET Assay
IC50
<1000±n/a nM
Citation
 McCall, JMRomero, DLMcKearn, JClare, M Heterocyclic compounds for the inhibition of PASK US Patent  US10781185 Publication Date 9/22/2020 
Target
Name:
PAS domain-containing serine/threonine-protein kinase
Synonyms:
KIAA0135 PASK PASK_HUMAN | hPASK
Type:
PROTEIN
Mol. Mass.:
142867.26
Organism:
Homo sapiens (Human)
Description:
ChEMBL_944230
Residue:
1323
  
Inhibitor
Name:
BDBM463550
Synonyms:
2-(4-Fluorophenyl)-3-(methyl(piperidin-4-yl)amino)quinoxaline-6-carboxylic acid US11459307, Example 104
Type:
Small organic molecule
Emp. Form.:
C21H21FN4O2
Mol. Mass.:
380.4154
SMILES:
CN(C1CCNCC1)c1nc2cc(ccc2nc1-c1ccc(F)cc1)C(O)=O
: