Target
Plasma kallikrein
Ligand
BDBM392566
Substrate
Meas. Tech.
In Vitro Enzyme Inhibition
IC50
<100±n/a nM
Citation
 McDonald, AQian, S Therapeutic inhibitory compounds US Patent  US10781200 Publication Date 9/22/2020 
Target
Name:
Plasma kallikrein
Synonyms:
Fletcher factor KLKB1 Kallikrein Plasma kallikrein heavy chain Plasma prekallikrein
Type:
Protein
Mol. Mass.:
71391.16
Organism:
Homo sapiens (Human)
Description:
P03952
Residue:
638
  
Inhibitor
Name:
BDBM392566
Synonyms:
N-((6-amino-2,4-dimethylpyridin-3- yl)methyl)-1-((3-chloro-8- fluoroquinolin-6-yl)methyl)-3-cyano- 1H-pyrazole-4-carboxamide US10781200, Example 52
Type:
Small organic molecule
Emp. Form.:
C23H19ClFN7O
Mol. Mass.:
463.895
SMILES:
Cc1cc(N)nc(C)c1CNC(=O)c1cn(Cc2cc(F)c3ncc(Cl)cc3c2)nc1C#N
: