Target
Plasma kallikrein
Ligand
BDBM392601
Substrate
Meas. Tech.
In Vitro Enzyme Inhibition
IC50
550±n/a nM
Citation
 McDonald, AQian, S Therapeutic inhibitory compounds US Patent  US10781200 Publication Date 9/22/2020 
Target
Name:
Plasma kallikrein
Synonyms:
Fletcher factor KLKB1 Kallikrein Plasma kallikrein heavy chain Plasma prekallikrein
Type:
Protein
Mol. Mass.:
71391.16
Organism:
Homo sapiens (Human)
Description:
P03952
Residue:
638
  
Inhibitor
Name:
BDBM392601
Synonyms:
N-((6-amino-2-methylpyridin-3- yl)methyl)-2-((3-chloroquinolin-6- yl)methyl)-4-cyanooxazole-5- carboxamide US10781200, Example 88
Type:
Small organic molecule
Emp. Form.:
C22H17ClN6O2
Mol. Mass.:
432.862
SMILES:
Cc1nc(N)ccc1CNC(=O)c1oc(Cc2ccc3ncc(Cl)cc3c2)nc1C#N
: