Target
Plasma kallikrein
Ligand
BDBM392635
Substrate
Meas. Tech.
In Vitro Enzyme Inhibition
IC50
<100±n/a nM
Citation
 McDonald, AQian, S Therapeutic inhibitory compounds US Patent  US10781200 Publication Date 9/22/2020 
Target
Name:
Plasma kallikrein
Synonyms:
Fletcher factor KLKB1 Kallikrein Plasma kallikrein heavy chain Plasma prekallikrein
Type:
Protein
Mol. Mass.:
71391.16
Organism:
Homo sapiens (Human)
Description:
P03952
Residue:
638
  
Inhibitor
Name:
BDBM392635
Synonyms:
N-((6-amino-2,4-dimethylpyridin-3- yl)methyl)-1-((3-chloroquinolin-6- yl)methyl)-5-methoxy-1H- pyrazolo[3,4-c]pyridine-3- carboxamide US10781200, Example 122
Type:
Small organic molecule
Emp. Form.:
C26H24ClN7O2
Mol. Mass.:
501.967
SMILES:
COc1cc2c(nn(Cc3ccc4ncc(Cl)cc4c3)c2cn1)C(=O)NCc1c(C)cc(N)nc1C
: