Target
Non-receptor tyrosine-protein kinase TYK2
Ligand
BDBM463741
Substrate
Meas. Tech.
Caliper Assay
Ki
5±n/a nM
Citation
 Masse, CEGreenwood, JRRomero, DLHarriman, GCWester, RTShelley, MKennedy-Smith, JJDahlgren, MMondal, SRobinson, S TYK2 inhibitors and uses thereof US Patent  US10781204 Publication Date 9/22/2020 
Target
Name:
Non-receptor tyrosine-protein kinase TYK2
Synonyms:
Non-receptor tyrosine-protein kinase TYK2 (TYK2) TYK2_HUMAN | Tyrosine-protein kinase TYK2
Type:
Protein
Mol. Mass.:
133666.03
Organism:
Homo sapiens (Human)
Description:
P29597
Residue:
1187
  
Inhibitor
Name:
BDBM463741
Synonyms:
US10781204, Compound I-218 | US11434240, Compound I-218
Type:
Small organic molecule
Emp. Form.:
C26H26FN7O3
Mol. Mass.:
503.5281
SMILES:
O[C@@H]1CCN(C[C@@H]1N1CCOCC1)c1ccn(n1)-c1cc(nc2CNC(=O)c12)-c1c(F)cccc1C#N
: