Target
Bromodomain-containing protein 4
Ligand
BDBM391501
Substrate
Meas. Tech.
AlphaScreen Assay
IC50
<100±n/a nM
Citation
 Combs, APMaduskuie, Jr., TPFalahatpisheh, N 1H-pyrrolo[2,3-c]pyridin-7(6H)-ones and pyrazolo[3,4-c]pyridin-7(6H)-ones as inhibitors of BET proteins US Patent  US10781209 Publication Date 9/22/2020 
Target
Name:
Bromodomain-containing protein 4
Synonyms:
BRD4 Bromodomain-containing protein 4 (BRD4) Protein HUNK1
Type:
Protein
Mol. Mass.:
152264.84
Organism:
Homo sapiens (Human)
Description:
O60885
Residue:
1362
  
Inhibitor
Name:
BDBM391501
Synonyms:
US10472358, Example 1 US11059821, Example 1 US9957268, Example 1
Type:
Small organic molecule
Emp. Form.:
C22H17N3O3
Mol. Mass.:
371.3887
SMILES:
Cn1cc(-c2cccc3NC(=O)C(Oc23)c2ccccc2)c2cc[nH]c2c1=O
: