Target
Bromodomain-containing protein 4
Ligand
BDBM391538
Substrate
Meas. Tech.
AlphaScreen Assay
IC50
<100±n/a nM
Citation
 Combs, APMaduskuie, Jr., TPFalahatpisheh, N 1H-pyrrolo[2,3-c]pyridin-7(6H)-ones and pyrazolo[3,4-c]pyridin-7(6H)-ones as inhibitors of BET proteins US Patent  US10781209 Publication Date 9/22/2020 
Target
Name:
Bromodomain-containing protein 4
Synonyms:
BRD4 Bromodomain-containing protein 4 (BRD4) Protein HUNK1
Type:
Protein
Mol. Mass.:
152264.84
Organism:
Homo sapiens (Human)
Description:
O60885
Residue:
1362
  
Inhibitor
Name:
BDBM391538
Synonyms:
2-isopropyl-N,N-dimethyl-8- (6-methyl-7-oxo-6,7-dihydro- 1H-pyrrolo[2,3-c]pyridin-4- yl)-3-oxo-3,4-dihydro-2H-1,4- benzoxazine-6-carboxamide US10781209, Example 34 US11702416, Example 34 | US9957268, Example 34
Type:
Small organic molecule
Emp. Form.:
C22H24N4O4
Mol. Mass.:
408.4504
SMILES:
CC(C)C1Oc2c(NC1=O)cc(cc2-c1cn(C)c(=O)c2[nH]ccc12)C(=O)N(C)C
: