Target
Bromodomain-containing protein 4
Ligand
BDBM419989
Substrate
Meas. Tech.
AlphaScreen Assay
IC50
<100±n/a nM
Citation
 Combs, APMaduskuie, Jr., TPFalahatpisheh, N 1H-pyrrolo[2,3-c]pyridin-7(6H)-ones and pyrazolo[3,4-c]pyridin-7(6H)-ones as inhibitors of BET proteins US Patent  US10781209 Publication Date 9/22/2020 
Target
Name:
Bromodomain-containing protein 4
Synonyms:
BRD4 Bromodomain-containing protein 4 (BRD4) Protein HUNK1
Type:
Protein
Mol. Mass.:
152264.84
Organism:
Homo sapiens (Human)
Description:
O60885
Residue:
1362
  
Inhibitor
Name:
BDBM419989
Synonyms:
4-ethyl-2-isopropyl-8-(6- methyl-7-oxo-6,7-dihydro- 1H-pyrrolo[2,3-c]pyridin-4- yl)-6-(methylsulfonyl)-2H- 1,4-benzoxazin-3(4H)-one US10781209, Example 54 US11702416, Example 54
Type:
Small organic molecule
Emp. Form.:
C22H25N3O5S
Mol. Mass.:
443.516
SMILES:
CCN1C(=O)C(Oc2c1cc(cc2-c1cn(C)c(=O)c2[nH]ccc12)S(C)(=O)=O)C(C)C
: