Target
Monoglyceride lipase
Ligand
BDBM280639
Substrate
Meas. Tech.
In Vitro Competitive Activity-Based Protein Profiling Assay
IC50
<100±n/a nM
Citation
 Buzard, DJShaghafi, MBCisar, JSGrice, CAJones, TKWeber, OD Spirocycle compounds and methods of making and using same US Patent  US10781211 Publication Date 9/22/2020 
Target
Name:
Monoglyceride lipase
Synonyms:
MAG lipase Mgll Monoglyceride Lipase (MGL)
Type:
Hydrolase
Mol. Mass.:
33391.67
Organism:
Mus musculus (mouse)
Description:
Assays were using membranes of recombinant MAG Lipase transiently transfected in COS-7 cells.
Residue:
303
  
Inhibitor
Name:
BDBM280639
Synonyms:
US10030020, Example 184 | US10781211, Example 184
Type:
Small organic molecule
Emp. Form.:
C20H20ClF9N2O2
Mol. Mass.:
526.824
SMILES:
FC(F)(F)C(OC(=O)N1CCC2(CCCN2Cc2ccc(Cl)c(c2)C(F)(F)F)CC1)C(F)(F)F
: