Target
Cannabinoid receptor 1
Ligand
BDBM463804
Substrate
Meas. Tech.
Radioligand Displacement Assay
Ki
60.0±n/a nM
Citation
 Kunos, GIyer, MCinar, RRice, KC Cannabinoid receptor mediating iminopyrazole compounds US Patent  US10787419 Publication Date 9/29/2020 
Target
Name:
Cannabinoid receptor 1
Synonyms:
Brain-type cannabinoid receptor CB-R CNR1_MOUSE Cannabinoid receptor | Cnr1
Type:
Enzyme
Mol. Mass.:
52842.52
Organism:
Mus musculus (Mouse)
Description:
P47746
Residue:
473
  
Inhibitor
Name:
BDBM463804
Synonyms:
US10787419, Serial # 16
Type:
Small organic molecule
Emp. Form.:
C27H20Cl2N4O2S2
Mol. Mass.:
567.509
SMILES:
Clc1ccc(cc1)C1=NN(CC1c1ccccc1)C(=N\S(=O)(=O)c1ccc(Cl)cc1)\C(=N)c1cccs1
: