Target
Cannabinoid receptor 1
Ligand
BDBM463807
Substrate
Meas. Tech.
Radioligand Displacement Assay
Ki
7.70±n/a nM
Citation
 Kunos, GIyer, MCinar, RRice, KC Cannabinoid receptor mediating iminopyrazole compounds US Patent  US10787419 Publication Date 9/29/2020 
Target
Name:
Cannabinoid receptor 1
Synonyms:
Brain-type cannabinoid receptor CB-R CNR1_MOUSE Cannabinoid receptor | Cnr1
Type:
Enzyme
Mol. Mass.:
52842.52
Organism:
Mus musculus (Mouse)
Description:
P47746
Residue:
473
  
Inhibitor
Name:
BDBM463807
Synonyms:
US10787419, Serial # 19
Type:
Small organic molecule
Emp. Form.:
C29H20Cl2F2N4O2S
Mol. Mass.:
597.463
SMILES:
Fc1ccc(C(=N)C(=N/S(=O)(=O)c2ccc(Cl)cc2)\N2CC(C(=N2)c2ccc(Cl)cc2)c2ccccc2)c(F)c1
: