Target
Cannabinoid receptor 1
Ligand
BDBM463854
Substrate
Meas. Tech.
Radioligand Displacement Assay
Ki
241±n/a nM
Citation
 Kunos, GIyer, MCinar, RRice, KC Cannabinoid receptor mediating iminopyrazole compounds US Patent  US10787419 Publication Date 9/29/2020 
Target
Name:
Cannabinoid receptor 1
Synonyms:
Brain-type cannabinoid receptor CB-R CNR1_MOUSE Cannabinoid receptor | Cnr1
Type:
Enzyme
Mol. Mass.:
52842.52
Organism:
Mus musculus (Mouse)
Description:
P47746
Residue:
473
  
Inhibitor
Name:
BDBM463854
Synonyms:
US10787419, Serial # 55
Type:
Small organic molecule
Emp. Form.:
C27H25Cl2N5O2S
Mol. Mass.:
554.491
SMILES:
Clc1ccc(cc1)C1=NN(CC1c1ccccc1)C(=N\S(=O)(=O)c1ccc(Cl)cc1)\C(=N)N1CCCC1
: