Target
15-hydroxyprostaglandin dehydrogenase [NAD(+)]
Ligand
BDBM463891
Substrate
Meas. Tech.
Inhibitory Activity Assay
IC50
50.0±n/a nM
Citation
 Cho, HYoon, E Thiazolidinedione derivative and use thereof US Patent  US10787425 Publication Date 9/29/2020 
Target
Name:
15-hydroxyprostaglandin dehydrogenase [NAD(+)]
Synonyms:
15-PGDH HPGD PGDH_HUMAN SDR36C1
Type:
Enzyme
Mol. Mass.:
28974.46
Organism:
Homo sapiens (Human)
Description:
P15428
Residue:
266
  
Inhibitor
Name:
BDBM463891
Synonyms:
US10787425, Compound 18
Type:
Small organic molecule
Emp. Form.:
C16H14BrNO4S
Mol. Mass.:
396.256
SMILES:
Brc1cc(\C=C2/SC(=O)NC2=O)ccc1OC(=O)C1CCCC1
: