Target
15-hydroxyprostaglandin dehydrogenase [NAD(+)]
Ligand
BDBM463928
Substrate
Meas. Tech.
Inhibitory Activity Assay
IC50
23.8±n/a nM
Citation
 Cho, HYoon, E Thiazolidinedione derivative and use thereof US Patent  US10787425 Publication Date 9/29/2020 
Target
Name:
15-hydroxyprostaglandin dehydrogenase [NAD(+)]
Synonyms:
15-PGDH HPGD PGDH_HUMAN SDR36C1
Type:
Enzyme
Mol. Mass.:
28974.46
Organism:
Homo sapiens (Human)
Description:
P15428
Residue:
266
  
Inhibitor
Name:
BDBM463928
Synonyms:
US10787425, Compound 54
Type:
Small organic molecule
Emp. Form.:
C22H27NO5S
Mol. Mass.:
417.518
SMILES:
CCOc1cc(\C=C2/SC(=O)NC2=O)ccc1OC(=O)CCCC1CCCCC1
: