Target
15-hydroxyprostaglandin dehydrogenase [NAD(+)]
Ligand
BDBM463959
Substrate
Meas. Tech.
Inhibitory Activity Assay
IC50
25.6±n/a nM
Citation
 Cho, HYoon, E Thiazolidinedione derivative and use thereof US Patent  US10787425 Publication Date 9/29/2020 
Target
Name:
15-hydroxyprostaglandin dehydrogenase [NAD(+)]
Synonyms:
15-PGDH HPGD PGDH_HUMAN SDR36C1
Type:
Enzyme
Mol. Mass.:
28974.46
Organism:
Homo sapiens (Human)
Description:
P15428
Residue:
266
  
Inhibitor
Name:
BDBM463959
Synonyms:
US10787425, Compound 85
Type:
Small organic molecule
Emp. Form.:
C21H24ClNO4S
Mol. Mass.:
421.938
SMILES:
Clc1c(OC(=O)CCCCC2CCCCC2)cccc1\C=C1/SC(=O)NC1=O
: