Target
Protein arginine N-methyltransferase 5
Ligand
BDBM463983
Substrate
Meas. Tech.
Biochemical Assay
IC50
37.0±n/a nM
Citation
 Bergman, YECamerino, MAStupple, PA Benzopiperdine derivatives and their use in the treatment of cancer and hemoglobinopathies US Patent  US10787434 Publication Date 9/29/2020 
Target
Name:
Protein arginine N-methyltransferase 5
Synonyms:
72 kDa ICln-binding protein HRMT1L5 IBP72 Jak-binding protein 1 PRMT5/MEP50 complex Protein arginine methyltransferase 5 (PRMT5) SKB1 homolog Shk1 kinase-binding protein 1 homolog
Type:
Enzyme
Mol. Mass.:
72679.99
Organism:
Homo sapiens (Human)
Description:
O14744
Residue:
637
  
Inhibitor
Name:
BDBM463983
Synonyms:
US10787434, Example 1
Type:
Small organic molecule
Emp. Form.:
C25H33N5O5
Mol. Mass.:
483.56
SMILES:
CCOc1nc(ccc1C(=O)NC[C@@H](O)[C@@H]1Cc2ccccc2CN1)N1CCN(CC1)C(=O)OC
: